Reaction Details
TargetMethionine aminopeptidase 1
LigandBDBM50435232
Substrate/Competitorn/a
Meas. Tech.ChEMBL_963503 (CHEMBL2394384)
IC50 11000±n/a nM
Citation Zhang, PYang, XZhang, FGabelli, SBWang, RZhang, YBhat, SChen, XFurlani, MAmzel, LMLiu, JOMa, D Pyridinylpyrimidines selectively inhibit human methionine aminopeptidase-1. Bioorg Med Chem21:2600-17 (2013) 
 
Methionine aminopeptidase 1
Name:Methionine aminopeptidase 1
Type:Enzyme
Mol. Mass.:43220.79
Organism:Homo sapiens (Human)
Description:MetAP1 with an N-terminal six histidine tag was expressed in baculovirus infected sf9 cells.
Residue:386
BDBM50435232
NameBDBM50435232
Synonyms:CHEMBL2392768
TypeSmall organic molecule
Emp. Form.C17H14ClN3S
Mol. Mass.327.831
SMILESCc1nc(nc(SCc2ccccc2)c1Cl)-c1ccccn1