Reaction Details
TargetAcetylcholinesterase
LigandBDBM50435278
Substrate/Competitorn/a
Meas. Tech.ChEMBL_963635 (CHEMBL2395154)
IC50 1.0±n/a nM
Citation Eckroat, TJGreen, KDReed, RABornstein, JJGarneau-Tsodikova, S Investigation of the role of linker moieties in bifunctional tacrine hybrids. Bioorg Med Chem21:3614-23 (2013) 
 
Acetylcholinesterase
Name:Acetylcholinesterase
Type:Enzyme
Mol. Mass.:71812.79
Organism:Electrophorus electricus (Electric eel)
Description:n/a
Residue:633
BDBM50435278
NameBDBM50435278
Synonyms:CHEMBL2393108
TypeSmall organic molecule
Emp. Form.C34H39ClN4O
Mol. Mass.555.153
SMILESCc1cccc(Nc2ccccc2C(=O)NCCCCCCNc2c3CCCCc3nc3cc(Cl)ccc23)c1C