Reaction Details
TargetAcetylcholinesterase
LigandBDBM50435294
Substrate/Competitorn/a
Meas. Tech.ChEMBL_963635 (CHEMBL2395154)
IC50 7.9±n/a nM
Citation Eckroat, TJGreen, KDReed, RABornstein, JJGarneau-Tsodikova, S Investigation of the role of linker moieties in bifunctional tacrine hybrids. Bioorg Med Chem21:3614-23 (2013) 
 
Acetylcholinesterase
Name:Acetylcholinesterase
Type:Enzyme
Mol. Mass.:71812.79
Organism:Electrophorus electricus (Electric eel)
Description:n/a
Residue:633
BDBM50435294
NameBDBM50435294
Synonyms:CHEMBL2393092
TypeSmall organic molecule
Emp. Form.C19H26ClN3
Mol. Mass.331.883
SMILESNCCCCCCNc1c2CCCCc2nc2cc(Cl)ccc12