Reaction Details
TargetAcetylcholinesterase
LigandBDBM50435272
Substrate/Competitorn/a
Meas. Tech.ChEMBL_963636 (CHEMBL2395155)
IC50 7.9±n/a nM
Citation Eckroat, TJGreen, KDReed, RABornstein, JJGarneau-Tsodikova, S Investigation of the role of linker moieties in bifunctional tacrine hybrids. Bioorg Med Chem21:3614-23 (2013) 
 
Acetylcholinesterase
Name:Acetylcholinesterase
Type:Enzyme
Mol. Mass.:71812.79
Organism:Electrophorus electricus (Electric eel)
Description:n/a
Residue:633
BDBM50435272
NameBDBM50435272
Synonyms:CHEMBL2393225
TypeSmall organic molecule
Emp. Form.C39H48ClN5O2
Mol. Mass.654.284
SMILESCc1cccc(Nc2ccccc2C(=O)NCCCC(=O)NCCCCCCCNc2c3CCCCc3nc3cc(Cl)ccc23)c1C