Reaction Details
TargetAcetylcholinesterase
LigandBDBM50435277
Substrate/Competitorn/a
Meas. Tech.ChEMBL_963636 (CHEMBL2395155)
IC50 1.1±n/a nM
Citation Eckroat, TJGreen, KDReed, RABornstein, JJGarneau-Tsodikova, S Investigation of the role of linker moieties in bifunctional tacrine hybrids. Bioorg Med Chem21:3614-23 (2013) 
 
Acetylcholinesterase
Name:Acetylcholinesterase
Type:Enzyme
Mol. Mass.:71812.79
Organism:Electrophorus electricus (Electric eel)
Description:n/a
Residue:633
BDBM50435277
NameBDBM50435277
Synonyms:CHEMBL2393109
TypeSmall organic molecule
Emp. Form.C37H44ClN5O2
Mol. Mass.626.231
SMILESCc1cccc(Nc2ccccc2C(=O)NCCC(=O)NCCCCCCNc2c3CCCCc3nc3cc(Cl)ccc23)c1C