Reaction Details
TargetAcetylcholinesterase
LigandBDBM50435284
Substrate/Competitorn/a
Meas. Tech.ChEMBL_963636 (CHEMBL2395155)
IC50 5.2±n/a nM
Citation Eckroat, TJGreen, KDReed, RABornstein, JJGarneau-Tsodikova, S Investigation of the role of linker moieties in bifunctional tacrine hybrids. Bioorg Med Chem21:3614-23 (2013) 
 
Acetylcholinesterase
Name:Acetylcholinesterase
Type:Enzyme
Mol. Mass.:71812.79
Organism:Electrophorus electricus (Electric eel)
Description:n/a
Residue:633
BDBM50435284
NameBDBM50435284
Synonyms:CHEMBL2393102
TypeSmall organic molecule
Emp. Form.C23H33ClN2
Mol. Mass.372.975
SMILESCCCCCCCCCCNc1c2CCCCc2nc2cc(Cl)ccc12