Reaction Details
TargetNeuronal acetylcholine receptor subunit alpha-4/beta-4
LigandBDBM50014210
Substrate/Competitorn/a
Meas. Tech.ChEMBL_964974 (CHEMBL2396007)
Ki>10000±n/a nM
Citation Arunotayanun, WDalley, JWHuang, XPSetola, VTreble, RIversen, LRoth, BLGibbons, S An analysis of the synthetic tryptamines AMT and 5-MeO-DALT: emerging 'Novel Psychoactive Drugs'. Bioorg Med Chem Lett23:3411-5 (2013) 
 
Neuronal acetylcholine receptor subunit alpha-4/beta-4
Name:Neuronal acetylcholine receptor subunit alpha-4/beta-4
Type:n/a
Mol. Mass.:n/a
Description:ASSAY_ID of EBI is 143890
Components:This complex has 2 components.
Component 1
Name:Neuronal acetylcholine receptor subunit beta-4
Synonyms:ACHB4_HUMAN Cholinergic, Nicotinic Alpha6Beta3Beta4Alpha5 Nicotinic acetylcholine receptor alpha6/alpha3/beta4
Type:Enzyme Catalytic Domain
Mol. Mass.:56388.51
Organism:Homo sapiens (Human)
Description:Cholinergic, Nicotinic Alpha6Beta3Beta4Alpha5 0 HUMAN::P30926
Residue:498
Component 2
Name:Neuronal acetylcholine receptor subunit alpha-4
Synonyms:ACHA4_HUMAN CHRNA4 protein Neuronal acetylcholine receptor protein alpha-4 subunit Nicotinic acetylcholine receptor alpha4/beta2/alpha5
Type:n/a
Mol. Mass.:69963.49
Organism:Homo sapiens (Human)
Description:NACHRA4
Residue:627
BDBM50014210
NameBDBM50014210
Synonyms:1-(1H-Indol-3-yl)-2-propanamine 3-(2-Aminopropyl)indole DL-3-(2-Aminopropyl)indole alpha-Methyl-1H-indole-3-ethanamine alpha-Methyl-beta-indoleethylamine | alpha-methyltryptamine
TypeSmall organic molecule
Emp. Form.C11H14N2
Mol. Mass.174.2423
SMILESCC(N)Cc1c[nH]c2ccccc12