Reaction Details
TargetSigma non-opioid intracellular receptor 1
LigandBDBM50435344
Substrate/Competitorn/a
Meas. Tech.ChEMBL_964937 (CHEMBL2395634)
Ki 400±n/a nM
Citation Arunotayanun, WDalley, JWHuang, XPSetola, VTreble, RIversen, LRoth, BLGibbons, S An analysis of the synthetic tryptamines AMT and 5-MeO-DALT: emerging 'Novel Psychoactive Drugs'. Bioorg Med Chem Lett23:3411-5 (2013) 
 
Sigma non-opioid intracellular receptor 1
Name:Sigma non-opioid intracellular receptor 1
Type:Protein
Mol. Mass.:25307.17
Organism:Cavia porcellus (Guinea pig)
Description:Q60492
Residue:223
BDBM50435344
NameBDBM50435344
Synonyms:CHEMBL2391541
TypeSmall organic molecule
Emp. Form.C17H22N2O
Mol. Mass.270.3694
SMILESCOc1ccc2[nH]cc(CCN(CC=C)CC=C)c2c1