Reaction Details
TargetSigma non-opioid intracellular receptor 1
LigandBDBM50014210
Substrate/Competitorn/a
Meas. Tech.ChEMBL_964937 (CHEMBL2395634)
Ki>10000±n/a nM
Citation Arunotayanun, WDalley, JWHuang, XPSetola, VTreble, RIversen, LRoth, BLGibbons, S An analysis of the synthetic tryptamines AMT and 5-MeO-DALT: emerging 'Novel Psychoactive Drugs'. Bioorg Med Chem Lett23:3411-5 (2013) 
 
Sigma non-opioid intracellular receptor 1
Name:Sigma non-opioid intracellular receptor 1
Type:Protein
Mol. Mass.:25307.17
Organism:Cavia porcellus (Guinea pig)
Description:Q60492
Residue:223
BDBM50014210
NameBDBM50014210
Synonyms:1-(1H-Indol-3-yl)-2-propanamine 3-(2-Aminopropyl)indole DL-3-(2-Aminopropyl)indole alpha-Methyl-1H-indole-3-ethanamine alpha-Methyl-beta-indoleethylamine | alpha-methyltryptamine
TypeSmall organic molecule
Emp. Form.C11H14N2
Mol. Mass.174.2423
SMILESCC(N)Cc1c[nH]c2ccccc12