Reaction Details
TargetDual specificity tyrosine-phosphorylation-regulated kinase 1A
LigandBDBM50435426
Substrate/Competitorn/a
Meas. Tech.ChEMBL_965909 (CHEMBL2394340)
IC50 7.0±n/a nM
Citation Coombs, TCTanega, CShen, MWang, JLAuld, DSGerritz, SWSchoenen, FJThomas, CJAubé, J Small-molecule pyrimidine inhibitors of the cdc2-like (Clk) and dual specificity tyrosine phosphorylation-regulated (Dyrk) kinases: development of chemical probe ML315. Bioorg Med Chem Lett23:3654-61 (2013) 
 
Dual specificity tyrosine-phosphorylation-regulated kinase 1A
Name:Dual specificity tyrosine-phosphorylation-regulated kinase 1A
Type:Enzyme
Mol. Mass.:85616.61
Organism:Homo sapiens (Human)
Description:Q13627
Residue:763
BDBM50435426
NameBDBM50435426
Synonyms:CHEMBL1877990
TypeSmall organic molecule
Emp. Form.C17H14N4O2
Mol. Mass.306.3187
SMILESC(Nc1nccc(n1)-c1ccc2OCOc2c1)c1cccnc1