Reaction Details
TargetDual specificity protein kinase CLK4
LigandBDBM50435449
Substrate/Competitorn/a
Meas. Tech.ChEMBL_965912 (CHEMBL2394343)
IC50 4.0±n/a nM
Citation Coombs, TCTanega, CShen, MWang, JLAuld, DSGerritz, SWSchoenen, FJThomas, CJAubé, J Small-molecule pyrimidine inhibitors of the cdc2-like (Clk) and dual specificity tyrosine phosphorylation-regulated (Dyrk) kinases: development of chemical probe ML315. Bioorg Med Chem Lett23:3654-61 (2013) 
 
Dual specificity protein kinase CLK4
Name:Dual specificity protein kinase CLK4
Type:Serine/threonine-protein kinase
Mol. Mass.:57522.53
Organism:Homo sapiens (Human)
Description:gi_10190706
Residue:481
BDBM50435449
NameBDBM50435449
Synonyms:CHEMBL2392364
TypeSmall organic molecule
Emp. Form.C18H13Cl2N3O2
Mol. Mass.374.221
SMILESClc1cc(Cl)cc(CNc2nccc(n2)-c2ccc3OCOc3c2)c1