Reaction Details
TargetDual specificity protein kinase CLK1
LigandBDBM50435473
Substrate/Competitorn/a
Meas. Tech.ChEMBL_965921 (CHEMBL2394352)
IC50 20±n/a nM
Citation Coombs, TCTanega, CShen, MWang, JLAuld, DSGerritz, SWSchoenen, FJThomas, CJAubé, J Small-molecule pyrimidine inhibitors of the cdc2-like (Clk) and dual specificity tyrosine phosphorylation-regulated (Dyrk) kinases: development of chemical probe ML315. Bioorg Med Chem Lett23:3654-61 (2013) 
 
Dual specificity protein kinase CLK1
Name:Dual specificity protein kinase CLK1
Type:Protein
Mol. Mass.:57322.21
Organism:Homo sapiens (Human)
Description:P49759
Residue:484
BDBM50435473
NameBDBM50435473
Synonyms:CHEMBL1236620
TypeSmall organic molecule
Emp. Form.C15H13Cl2N3O2
Mol. Mass.338.189
SMILESCCOC(=O)c1c(C(C=N)C#N)c2ccc(Cl)c(Cl)c2n1C