Reaction Details
TargetTyrosine-protein kinase JAK1
LigandBDBM50435521
Substrate/Competitorn/a
Meas. Tech.ChEMBL_966072 (CHEMBL2395113)
Ki 6.2±n/a nM
Citation Hurley, CABlair, WSBull, RJChang, CCrackett, PHDeshmukh, GDyke, HJFong, RGhilardi, NGibbons, PHewitt, PRJohnson, AJohnson, TKenny, JRKohli, PBKulagowski, JJLiimatta, MLupardus, PJMaxey, RJMendonca, RNarukulla, RPulk, RUbhayakar, Svan Abbema, AWard, SIWaszkowycz, BZak, M Novel triazolo-pyrrolopyridines as inhibitors of Janus kinase 1. Bioorg Med Chem Lett23:3592-8 (2013) 
 
Tyrosine-protein kinase JAK1
Name:Tyrosine-protein kinase JAK1
Type:Protein
Mol. Mass.:133293.73
Organism:Homo sapiens (Human)
Description:P23458
Residue:1154
BDBM50435521
NameBDBM50435521
Synonyms:CHEMBL2392489
TypeSmall organic molecule
Emp. Form.C13H16N6O2S
Mol. Mass.320.37
SMILESCS(=O)(=O)N1CCC(CC1)n1nnc2cnc3[nH]ccc3c12