Reaction Details
TargetTyrosine-protein kinase JAK1
LigandBDBM50391996
Substrate/Competitorn/a
Meas. Tech.ChEMBL_966072 (CHEMBL2395113)
Ki 0.400000±n/a nM
Citation Hurley, CABlair, WSBull, RJChang, CCrackett, PHDeshmukh, GDyke, HJFong, RGhilardi, NGibbons, PHewitt, PRJohnson, AJohnson, TKenny, JRKohli, PBKulagowski, JJLiimatta, MLupardus, PJMaxey, RJMendonca, RNarukulla, RPulk, RUbhayakar, Svan Abbema, AWard, SIWaszkowycz, BZak, M Novel triazolo-pyrrolopyridines as inhibitors of Janus kinase 1. Bioorg Med Chem Lett23:3592-8 (2013) 
 
Tyrosine-protein kinase JAK1
Name:Tyrosine-protein kinase JAK1
Type:Protein
Mol. Mass.:133293.73
Organism:Homo sapiens (Human)
Description:P23458
Residue:1154
BDBM50391996
NameBDBM50391996
Synonyms:CHEMBL2152300
TypeSmall organic molecule
Emp. Form.C16H16N6O
Mol. Mass.308.3378
SMILESO=C(CC#N)N1CCC[C@H](C1)n1cnc2cnc3[nH]ccc3c12