Reaction Details
TargetHepatocyte growth factor receptor
LigandBDBM50383191
Substrate/Competitorn/a
Meas. Tech.ChEMBL_966266 (CHEMBL2395927)
IC50 1.000000±n/a nM
Citation Li, SHuang, QLiu, YZhang, XLiu, SHe, CGong, P Design, synthesis and antitumour activity of bisquinoline derivatives connected by 4-oxy-3-fluoroaniline moiety. Eur J Med Chem64:62-73 (2013) 
 
Hepatocyte growth factor receptor
Name:Hepatocyte growth factor receptor
Type:Protein
Mol. Mass.:155559.73
Organism:Homo sapiens (Human)
Description:P08581
Residue:1390
BDBM50383191
NameBDBM50383191
Synonyms:CHEMBL2031893
TypeSmall organic molecule
Emp. Form.C29H25FN4O5
Mol. Mass.528.531
SMILESCOc1cc2nccc(Oc3ccc(NC(=O)c4c(C)n(C)n(-c5ccccc5)c4=O)cc3F)c2cc1OC