Reaction Details
TargetHistone deacetylase 3
LigandBDBM19149
Substrate/Competitorn/a
Meas. Tech.ChEMBL_964226 (CHEMBL2395196)
IC50 55±n/a nM
Citation Thaler, FVarasi, MAbate, ACarenzi, GColombo, ABigogno, CBoggio, RZuffo, RDRapetti, DResconi, ARegalia, NVultaggio, SDondio, GGagliardi, SMinucci, SMercurio, C Synthesis and biological characterization of spiro[2H-(1,3)-benzoxazine-2,4'-piperidine] based histone deacetylase inhibitors. Eur J Med Chem64:273-84 (2013) 
 
Histone deacetylase 3
Name:Histone deacetylase 3
Type:Enzyme
Mol. Mass.:48829.55
Organism:Homo sapiens (Human)
Description:O15379
Residue:428
BDBM19149
NameBDBM19149
Synonyms:CHEMBL98 SAHA US10188756, Compound SAHA US11505523, Compound SAHA US9353061, SAHA US9695181, Vorinostat Zolinza suberoylanilide hydroxamic acid
TypeSmall organic molecule
Emp. Form.C14H20N2O3
Mol. Mass.264.3202
SMILESONC(=O)CCCCCCC(=O)Nc1ccccc1