Reaction Details
TargetC-C chemokine receptor type 1
LigandBDBM50435673
Substrate/Competitorn/a
Meas. Tech.ChEMBL_964990 (CHEMBL2396023)
IC50 1.4±n/a nM
Citation Hossain, NIvanova, SBergare, JMensonides-Harsema, MCooper, ME Design, synthesis and structure activity relationships of spirocyclic compounds as potent CCR1 antagonists. Bioorg Med Chem Lett23:3500-4 (2013) 
 
C-C chemokine receptor type 1
Name:C-C chemokine receptor type 1
Type:Enzyme
Mol. Mass.:41180.69
Organism:Homo sapiens (Human)
Description:P32246
Residue:355
BDBM50435673
NameBDBM50435673
Synonyms:CHEMBL2391795
TypeSmall organic molecule
Emp. Form.C25H29ClN2O5
Mol. Mass.472.961
SMILESO[C@H](COc1cc(O)ccc1C(=O)NC1CC1)CN1CCC2(Cc3cc(Cl)ccc3O2)CC1