Reaction Details
TargetC-C chemokine receptor type 1
LigandBDBM50435690
Substrate/Competitorn/a
Meas. Tech.ChEMBL_964990 (CHEMBL2396023)
IC50 0.920000±n/a nM
Citation Hossain, NIvanova, SBergare, JMensonides-Harsema, MCooper, ME Design, synthesis and structure activity relationships of spirocyclic compounds as potent CCR1 antagonists. Bioorg Med Chem Lett23:3500-4 (2013) 
 
C-C chemokine receptor type 1
Name:C-C chemokine receptor type 1
Type:Enzyme
Mol. Mass.:41180.69
Organism:Homo sapiens (Human)
Description:P32246
Residue:355
BDBM50435690
NameBDBM50435690
Synonyms:CHEMBL2391803
TypeSmall organic molecule
Emp. Form.C26H30Cl2N2O6
Mol. Mass.537.432
SMILESO[C@H](COc1cc(O)c(Cl)cc1C(=O)N1CC[C@H](O)C1)CN1CCC2(Cc3cc(Cl)ccc3O2)CC1