Reaction Details
Target11-beta-hydroxysteroid dehydrogenase 1
LigandBDBM50340378
Substrate/Competitorn/a
Meas. Tech.ChEMBL_965016 (CHEMBL2396178)
Ki 3.9±n/a nM
Citation Bauman, DRWhitehead, AContino, LCCui, JGarcia-Calvo, MGu, XKevin, NMa, XPai, LYShah, KShen, XStribling, SZokian, HJMetzger, JShevell, DEWaddell, ST Evaluation of selective inhibitors of 11ß-HSD1 for the treatment of hypertension. Bioorg Med Chem Lett23:3650-3 (2013) 
 
11-beta-hydroxysteroid dehydrogenase 1
Name:11-beta-hydroxysteroid dehydrogenase 1
Type:Enzyme
Mol. Mass.:31889.48
Organism:Rattus norvegicus (rat)
Description:P16232
Residue:288
BDBM50340378
NameBDBM50340378
Synonyms:3-(4-(2-(ethylsulfonyl)ethyl)bicyclo[2.2.2]octan-1-yl)-4-methyl-5-(2-(trifluoromethyl)phenyl)-4H-1,2,4-triazole | CHEMBL1761313
TypeSmall organic molecule
Emp. Form.C22H28F3N3O2S
Mol. Mass.455.537
SMILESCCS(=O)(=O)CCC12CCC(CC1)(CC2)c1nnc(-c2ccccc2C(F)(F)F)n1C