Reaction Details
Target11-beta-hydroxysteroid dehydrogenase 1
LigandBDBM50340386
Substrate/Competitorn/a
Meas. Tech.ChEMBL_965019 (CHEMBL2396181)
IC50>4000±n/a nM
Citation Bauman, DRWhitehead, AContino, LCCui, JGarcia-Calvo, MGu, XKevin, NMa, XPai, LYShah, KShen, XStribling, SZokian, HJMetzger, JShevell, DEWaddell, ST Evaluation of selective inhibitors of 11ß-HSD1 for the treatment of hypertension. Bioorg Med Chem Lett23:3650-3 (2013) 
 
11-beta-hydroxysteroid dehydrogenase 1
Name:11-beta-hydroxysteroid dehydrogenase 1
Type:Enzyme
Mol. Mass.:32409.16
Organism:Homo sapiens (Human)
Description:P28845
Residue:292
BDBM50340386
NameBDBM50340386
Synonyms:3-(4-(ethylsulfonylmethyl)bicyclo[2.2.2]octan-1-yl)-4-methyl-5-(2-(trifluoromethyl)phenyl)-4H-1,2,4-triazole | CHEMBL1761321
TypeSmall organic molecule
Emp. Form.C21H26F3N3O2S
Mol. Mass.441.51
SMILESCCS(=O)(=O)CC12CCC(CC1)(CC2)c1nnc(-c2ccccc2C(F)(F)F)n1C