Reaction Details
TargetAurora kinase A
LigandBDBM50277545
Substrate/Competitorn/a
Meas. Tech.ChEMBL_965034 (CHEMBL2396196)
IC50 1.000000±n/a nM
Citation Zheng, YZheng, MLing, XLiu, YXue, YAn, LGu, NJi, MJin, M Design, synthesis, quantum chemical studies and biological activity evaluation of pyrazole-benzimidazole derivatives as potent Aurora A/B kinase inhibitors. Bioorg Med Chem Lett23:3523-30 (2013) 
 
Aurora kinase A
Name:Aurora kinase A
Type:Serine/threonine-protein kinase
Mol. Mass.:45830.98
Organism:Homo sapiens (Human)
Description:O14965
Residue:403
BDBM50277545
NameBDBM50277545
Synonyms:4-(9-chloro-7-(2-fluoro-6-methoxyphenyl)-5H-benzo[c]pyrimido[4,5-e]azepin-2-ylamino)-2-methoxybenzoic acid CHEMBL483158 US10092556, Example MLN8237 | US9346787, MLN8237
TypeSmall organic molecule
Emp. Form.C27H20ClFN4O4
Mol. Mass.518.924
SMILESCOc1cc(Nc2ncc3CN=C(c4cc(Cl)ccc4-c3n2)c2c(F)cccc2OC)ccc1C(O)=O