Reaction Details
TargetAurora kinase B
LigandBDBM50435697
Substrate/Competitorn/a
Meas. Tech.ChEMBL_965037 (CHEMBL2396199)
IC50 1201±n/a nM
Citation Zheng, YZheng, MLing, XLiu, YXue, YAn, LGu, NJi, MJin, M Design, synthesis, quantum chemical studies and biological activity evaluation of pyrazole-benzimidazole derivatives as potent Aurora A/B kinase inhibitors. Bioorg Med Chem Lett23:3523-30 (2013) 
 
Aurora kinase B
Name:Aurora kinase B
Type:Protein
Mol. Mass.:39327.72
Organism:Homo sapiens (Human)
Description:Q96GD4
Residue:344
BDBM50435697
NameBDBM50435697
Synonyms:CHEMBL2392108
TypeSmall organic molecule
Emp. Form.C20H23ClN8
Mol. Mass.410.903
SMILESCCN(CC)Cc1ccc2nc([nH]c2c1)-c1n[nH]cc1Nc1cc(Cl)nc(C)n1