Reaction Details
TargetAurora kinase A
LigandBDBM50435692
Substrate/Competitorn/a
Meas. Tech.ChEMBL_965038 (CHEMBL2396200)
IC50 78±n/a nM
Citation Zheng, YZheng, MLing, XLiu, YXue, YAn, LGu, NJi, MJin, M Design, synthesis, quantum chemical studies and biological activity evaluation of pyrazole-benzimidazole derivatives as potent Aurora A/B kinase inhibitors. Bioorg Med Chem Lett23:3523-30 (2013) 
 
Aurora kinase A
Name:Aurora kinase A
Type:Serine/threonine-protein kinase
Mol. Mass.:45830.98
Organism:Homo sapiens (Human)
Description:O14965
Residue:403
BDBM50435692
NameBDBM50435692
Synonyms:CHEMBL2392113
TypeSmall organic molecule
Emp. Form.C20H23ClN8O2S
Mol. Mass.474.967
SMILESCCN(CC)Cc1ccc2nc([nH]c2c1)-c1n[nH]cc1Nc1cc(Cl)nc(n1)S(C)(=O)=O