Reaction Details
TargetEnoyl-acyl carrier reductase ENR
LigandBDBM50435720
Substrate/Competitorn/a
Meas. Tech.ChEMBL_965386 (CHEMBL2394873)
IC50 29±n/a nM
Citation Muench, SPStec, JZhou, YAfanador, GAMcPhillie, MJHickman, MRLee, PJLeed, SEAuschwitz, JMPrigge, STRice, DWMcLeod, R Development of a triclosan scaffold which allows for adaptations on both the A- and B-ring for transport peptides. Bioorg Med Chem Lett23:3551-5 (2013) 
 
Enoyl-acyl carrier reductase ENR
Name:Enoyl-acyl carrier reductase ENR
Type:PROTEIN
Mol. Mass.:43663.67
Organism:Toxoplasma gondii
Description:ChEMBL_1290812
Residue:417
BDBM50435720
NameBDBM50435720
Synonyms:CHEMBL2392447
TypeSmall organic molecule
Emp. Form.C19H15ClN2O3
Mol. Mass.354.787
SMILESCCCc1cc(no1)-c1ccc(Oc2ccc(cc2O)C#N)c(Cl)c1