Reaction Details
TargetBifunctional epoxide hydrolase 2
LigandBDBM50435764
Substrate/Competitorn/a
Meas. Tech.ChEMBL_965763 (CHEMBL2393702)
IC50 2.0±n/a nM
Citation Thalji, RKMcAtee, JJBelyanskaya, SBrandt, MBrown, GDCostell, MHDing, YDodson, JWEisennagel, SHFries, REGross, JWHarpel, MRHolt, DAIsrael, DIJolivette, LJKrosky, DLi, HLu, QMandichak, TRoethke, TSchnackenberg, CGSchwartz, BShewchuk, LMXie, WBehm, DJDouglas, SAShaw, ALMarino, JP Discovery of 1-(1,3,5-triazin-2-yl)piperidine-4-carboxamides as inhibitors of soluble epoxide hydrolase. Bioorg Med Chem Lett23:3584-8 (2013) 
 
Bifunctional epoxide hydrolase 2
Name:Bifunctional epoxide hydrolase 2
Type:PROTEIN
Mol. Mass.:62337.15
Organism:Rattus norvegicus
Description:ChEMBL_1465995
Residue:554
BDBM50435764
NameBDBM50435764
Synonyms:CHEMBL2392692
TypeSmall organic molecule
Emp. Form.C19H22BrF3N6O2
Mol. Mass.503.316
SMILESCNc1nc(C)nc(n1)N1CCC(CC1)C(=O)NCc1ccc(Br)cc1OC(F)(F)F