Reaction Details
TargetBifunctional epoxide hydrolase 2
LigandBDBM50435754
Substrate/Competitorn/a
Meas. Tech.ChEMBL_965766 (CHEMBL2393705)
IC50 3.0±n/a nM
Citation Thalji, RKMcAtee, JJBelyanskaya, SBrandt, MBrown, GDCostell, MHDing, YDodson, JWEisennagel, SHFries, REGross, JWHarpel, MRHolt, DAIsrael, DIJolivette, LJKrosky, DLi, HLu, QMandichak, TRoethke, TSchnackenberg, CGSchwartz, BShewchuk, LMXie, WBehm, DJDouglas, SAShaw, ALMarino, JP Discovery of 1-(1,3,5-triazin-2-yl)piperidine-4-carboxamides as inhibitors of soluble epoxide hydrolase. Bioorg Med Chem Lett23:3584-8 (2013) 
 
Bifunctional epoxide hydrolase 2
Name:Bifunctional epoxide hydrolase 2
Type:Enzyme
Mol. Mass.:62613.07
Organism:Homo sapiens (Human)
Description:P34913
Residue:555
BDBM50435754
NameBDBM50435754
Synonyms:CHEMBL2392697
TypeSmall organic molecule
Emp. Form.C22H27F3N6O2
Mol. Mass.464.484
SMILESCc1nc(nc(n1)N1CCC(CC1)C(=O)NCc1ccccc1C(F)(F)F)N1CCOCC1