Reaction Details
TargetP2Y purinoceptor 1
LigandBDBM50435826
Substrate/Competitorn/a
Meas. Tech.ChEMBL_963568 (CHEMBL2394755)
Ki 59±n/a nM
Citation Ruel, RL'Heureux, AThibeault, CDaris, JPMartel, APrice, LAWu, QHua, JWexler, RRRehfuss, RLam, PY New azole antagonists with high affinity for the P2Y(1) receptor. Bioorg Med Chem Lett23:3519-22 (2013) 
 
P2Y purinoceptor 1
Name:P2Y purinoceptor 1
Type:Enzyme
Mol. Mass.:42090.25
Organism:Homo sapiens (Human)
Description:P47900
Residue:373
BDBM50435826
NameBDBM50435826
Synonyms:CHEMBL2393212
TypeSmall organic molecule
Emp. Form.C24H23N3O2
Mol. Mass.385.4583
SMILESCC(C)(C)c1ccccc1Oc1ncccc1Nc1ncc(o1)-c1ccccc1