Reaction Details
TargetFocal adhesion kinase 1
LigandBDBM50435831
Substrate/Competitorn/a
Meas. Tech.ChEMBL_963734 (CHEMBL2395733)
IC50 28500±n/a nM
Citation Zhang, SLuo, YHe, LQLiu, ZJJiang, AQYang, YHZhu, HL Synthesis, biological evaluation, and molecular docking studies of novel 1,3,4-oxadiazole derivatives possessing benzotriazole moiety as FAK inhibitors with anticancer activity. Bioorg Med Chem21:3723-9 (2013) 
 
Focal adhesion kinase 1
Name:Focal adhesion kinase 1
Type:Tyrosine-protein kinase
Mol. Mass.:119233.17
Organism:Homo sapiens (Human)
Description:Q05397
Residue:1052
BDBM50435831
NameBDBM50435831
Synonyms:CHEMBL2393376
TypeSmall organic molecule
Emp. Form.C16H11Cl2N5OS
Mol. Mass.392.262
SMILESClc1ccc(CSc2nnc(Cn3nnc4ccccc34)o2)cc1Cl