Reaction Details
TargetFocal adhesion kinase 1
LigandBDBM50435843
Substrate/Competitorn/a
Meas. Tech.ChEMBL_963734 (CHEMBL2395733)
IC50 7600±n/a nM
Citation Zhang, SLuo, YHe, LQLiu, ZJJiang, AQYang, YHZhu, HL Synthesis, biological evaluation, and molecular docking studies of novel 1,3,4-oxadiazole derivatives possessing benzotriazole moiety as FAK inhibitors with anticancer activity. Bioorg Med Chem21:3723-9 (2013) 
 
Focal adhesion kinase 1
Name:Focal adhesion kinase 1
Type:Tyrosine-protein kinase
Mol. Mass.:119233.17
Organism:Homo sapiens (Human)
Description:Q05397
Residue:1052
BDBM50435843
NameBDBM50435843
Synonyms:CHEMBL2393383
TypeSmall organic molecule
Emp. Form.C16H12N6O3S
Mol. Mass.368.37
SMILES[O-][N+](=O)c1ccccc1CSc1nnc(Cn2nnc3ccccc23)o1