Reaction Details
TargetCarbonic anhydrase 13
LigandBDBM50435886
Substrate/Competitorn/a
Meas. Tech.ChEMBL_963772 (CHEMBL2395933)
Ki 960±n/a nM
Citation Carreyre, HCoustard, JMCarré, GVandebrouck, CBescond, JOuédraogo, MMarrot, JVullo, DSupuran, CTThibaudeau, S Natural product hybrid and its superacid synthesized analogues: dodoneine and its derivatives show selective inhibition of carbonic anhydrase isoforms I, III, XIII and XIV. Bioorg Med Chem21:3790-4 (2013) 
 
Carbonic anhydrase 13
Name:Carbonic anhydrase 13
Type:Enzyme
Mol. Mass.:29522.80
Organism:Mus musculus (mouse)
Description:Murine cloned isozyme
Residue:262
BDBM50435886
NameBDBM50435886
Synonyms:CHEMBL2391084
TypeSmall organic molecule
Emp. Form.C15H17FO3
Mol. Mass.264.2921
SMILESOc1ccc(CC[C@@H](F)C[C@H]2CC=CC(=O)O2)cc1