Reaction Details
TargetN-formyl peptide receptor 3
LigandBDBM50435891
Substrate/Competitorn/a
Meas. Tech.ChEMBL_963919 (CHEMBL2393754)
EC50>50000±n/a nM
Citation Giovannoni, MPSchepetkin, IACilibrizzi, ACrocetti, LKhlebnikov, AIDahlgren, CGraziano, ADal Piaz, VKirpotina, LNZerbinati, SVergelli, CQuinn, MT Further studies on 2-arylacetamide pyridazin-3(2H)-ones: design, synthesis and evaluation of 4,6-disubstituted analogs as formyl peptide receptors (FPRs) agonists. Eur J Med Chem64:512-28 (2013) 
 
N-formyl peptide receptor 3
Name:N-formyl peptide receptor 3
Type:PROTEIN
Mol. Mass.:39971.00
Organism:Homo sapiens (Human)
Description:ChEMBL_580003
Residue:353
BDBM50435891
NameBDBM50435891
Synonyms:CHEMBL2391452
TypeSmall organic molecule
Emp. Form.C20H18BrN3O3
Mol. Mass.428.279
SMILESCOc1ccc(cc1)-c1cc(C)nn(CC(=O)Nc2ccc(Br)cc2)c1=O