Reaction Details
TargetAndrogen receptor
LigandBDBM18692
Substrate/Competitorn/a
Meas. Tech.ChEMBL_964273 (CHEMBL2395387)
EC50 31±n/a nM
Citation Purushottamachar, PGodbole, AMGediya, LKMartin, MSVasaitis, TSKwegyir-Afful, AKRamalingam, SAtes-Alagoz, ZNjar, VC Systematic structure modifications of multitarget prostate cancer drug candidate galeterone to produce novel androgen receptor down-regulating agents as an approach to treatment of advanced prostate cancer. J Med Chem56:4880-98 (2013) 
 
Androgen receptor
Name:Androgen receptor
Type:Receptor
Mol. Mass.:99185.27
Organism:Homo sapiens (Human)
Description:CHO cells were stably transfected with human AR gene.
Residue:920
BDBM18692
NameBDBM18692
Synonyms:(2S)-N-[4-cyano-3-(trifluoromethyl)phenyl]-3-[(4-fluorobenzene)sulfonyl]-2-hydroxy-2-methylpropanamide CHEMBL124881
TypeSmall organic molecule
Emp. Form.C18H14F4N2O4S
Mol. Mass.430.373
SMILESC[C@@](O)(CS(=O)(=O)c1ccc(F)cc1)C(=O)Nc1ccc(C#N)c(c1)C(F)(F)F