Reaction Details
TargetG-protein coupled receptor 35
LigandBDBM50436000
Substrate/Competitorn/a
Meas. Tech.ChEMBL_964313 (CHEMBL2395575)
EC50 11±n/a nM
Citation Funke, MThimm, DSchiedel, ACMüller, CE 8-Benzamidochromen-4-one-2-carboxylic acids: potent and selective agonists for the orphan G protein-coupled receptor GPR35. J Med Chem56:5182-97 (2013) 
 
G-protein coupled receptor 35
Name:G-protein coupled receptor 35
Type:Enzyme Catalytic Domain
Mol. Mass.:34085.57
Organism:Homo sapiens (Human)
Description:gi_33695097
Residue:309
BDBM50436000
NameBDBM50436000
Synonyms:CHEMBL2392179
TypeSmall organic molecule
Emp. Form.C18H11BrClNO6
Mol. Mass.452.64
SMILESCOc1ccc(C(=O)Nc2cc(Br)cc3c2oc(cc3=O)C(O)=O)c(Cl)c1