Reaction Details
TargetDNA polymerase beta
LigandBDBM38549
Substrate/Competitorn/a
Meas. Tech.ChEMBL_964288 (CHEMBL2395402)
IC50 9000±n/a nM
Citation Funke, MThimm, DSchiedel, ACMüller, CE 8-Benzamidochromen-4-one-2-carboxylic acids: potent and selective agonists for the orphan G protein-coupled receptor GPR35. J Med Chem56:5182-97 (2013) 
 
DNA polymerase beta
Name:DNA polymerase beta
Type:Protein
Mol. Mass.:38188.76
Organism:Homo sapiens (Human)
Description:n/a
Residue:335
BDBM38549
NameBDBM38549
Synonyms:2-[2-[4-[(4-chlorophenyl)-phenyl-methyl]piperazino]ethoxy]ethanol 4-[(3-carboxy-2-hydroxy-1-naphthalenyl)methyl]-3-hydroxy-2-naphthalenecarboxylic acid CHEMBL170358 HYDROXYZINE PAMOATE Pamoic acid US11744839, Compound of formula 8 | cid_25096
TypeSmall organic molecule
Emp. Form.C23H16O6
Mol. Mass.388.3695
SMILESOC(=O)c1cc2ccccc2c(Cc2c(O)c(cc3ccccc23)C(O)=O)c1O