Reaction Details
TargetG-protein coupled receptor 35
LigandBDBM50436012
Substrate/Competitorn/a
Meas. Tech.ChEMBL_964304 (CHEMBL2395566)
EC50 41±n/a nM
Citation Funke, MThimm, DSchiedel, ACMüller, CE 8-Benzamidochromen-4-one-2-carboxylic acids: potent and selective agonists for the orphan G protein-coupled receptor GPR35. J Med Chem56:5182-97 (2013) 
 
G-protein coupled receptor 35
Name:G-protein coupled receptor 35
Type:Enzyme Catalytic Domain
Mol. Mass.:34085.57
Organism:Homo sapiens (Human)
Description:gi_33695097
Residue:309
BDBM50436012
NameBDBM50436012
Synonyms:CHEMBL2392170
TypeSmall organic molecule
Emp. Form.C17H9BrClNO5
Mol. Mass.422.614
SMILESOC(=O)c1cc(=O)c2cc(Br)cc(NC(=O)c3ccc(Cl)cc3)c2o1