Reaction Details
TargetG protein-coupled receptor GPR35
LigandBDBM50436000
Substrate/Competitorn/a
Meas. Tech.ChEMBL_964307 (CHEMBL2395569)
EC50 4170±n/a nM
Citation Funke, MThimm, DSchiedel, ACMüller, CE 8-Benzamidochromen-4-one-2-carboxylic acids: potent and selective agonists for the orphan G protein-coupled receptor GPR35. J Med Chem56:5182-97 (2013) 
 
G protein-coupled receptor GPR35
Name:G protein-coupled receptor GPR35
Synonyms:GPR35
Type:PROTEIN
Mol. Mass.:34295.07
Organism:Rattus norvegicus
Description:ChEMBL_107605
Residue:306
BDBM50436000
NameBDBM50436000
Synonyms:CHEMBL2392179
TypeSmall organic molecule
Emp. Form.C18H11BrClNO6
Mol. Mass.452.64
SMILESCOc1ccc(C(=O)Nc2cc(Br)cc3c2oc(cc3=O)C(O)=O)c(Cl)c1