Reaction Details
TargetG protein-coupled receptor GPR35
LigandBDBM50436027
Substrate/Competitorn/a
Meas. Tech.ChEMBL_964307 (CHEMBL2395569)
EC50 6650±n/a nM
Citation Funke, MThimm, DSchiedel, ACMüller, CE 8-Benzamidochromen-4-one-2-carboxylic acids: potent and selective agonists for the orphan G protein-coupled receptor GPR35. J Med Chem56:5182-97 (2013) 
 
G protein-coupled receptor GPR35
Name:G protein-coupled receptor GPR35
Synonyms:GPR35
Type:PROTEIN
Mol. Mass.:34295.07
Organism:Rattus norvegicus
Description:ChEMBL_107605
Residue:306
BDBM50436027
NameBDBM50436027
Synonyms:CHEMBL2392147
TypeSmall organic molecule
Emp. Form.C14H11NO7
Mol. Mass.305.2396
SMILESCOC(=O)CC(=O)Nc1cccc2c1oc(cc2=O)C(O)=O