Reaction Details
TargetG-protein coupled receptor 35
LigandBDBM50435998
Substrate/Competitorn/a
Meas. Tech.ChEMBL_964310 (CHEMBL2395572)
EC50 4980±n/a nM
Citation Funke, MThimm, DSchiedel, ACMüller, CE 8-Benzamidochromen-4-one-2-carboxylic acids: potent and selective agonists for the orphan G protein-coupled receptor GPR35. J Med Chem56:5182-97 (2013) 
 
G-protein coupled receptor 35
Name:G-protein coupled receptor 35
Type:PROTEIN
Mol. Mass.:34163.11
Organism:Mus musculus
Description:ChEMBL_107606
Residue:307
BDBM50435998
NameBDBM50435998
Synonyms:CHEMBL2392183
TypeSmall organic molecule
Emp. Form.C17H11BrN2O6
Mol. Mass.419.183
SMILESCOc1ccc(cn1)C(=O)Nc1cc(Br)cc2c1oc(cc2=O)C(O)=O