Reaction Details
TargetG-protein coupled receptor 35
LigandBDBM50436005
Substrate/Competitorn/a
Meas. Tech.ChEMBL_964310 (CHEMBL2395572)
EC50 4950±n/a nM
Citation Funke, MThimm, DSchiedel, ACMüller, CE 8-Benzamidochromen-4-one-2-carboxylic acids: potent and selective agonists for the orphan G protein-coupled receptor GPR35. J Med Chem56:5182-97 (2013) 
 
G-protein coupled receptor 35
Name:G-protein coupled receptor 35
Type:PROTEIN
Mol. Mass.:34163.11
Organism:Mus musculus
Description:ChEMBL_107606
Residue:307
BDBM50436005
NameBDBM50436005
Synonyms:CHEMBL2392176
TypeSmall organic molecule
Emp. Form.C18H12BrNO6
Mol. Mass.418.195
SMILESCOc1ccccc1C(=O)Nc1cc(Br)cc2c1oc(cc2=O)C(O)=O