Reaction Details
TargetG-protein coupled receptor 35
LigandBDBM50436009
Substrate/Competitorn/a
Meas. Tech.ChEMBL_964310 (CHEMBL2395572)
EC50 5030±n/a nM
Citation Funke, MThimm, DSchiedel, ACMüller, CE 8-Benzamidochromen-4-one-2-carboxylic acids: potent and selective agonists for the orphan G protein-coupled receptor GPR35. J Med Chem56:5182-97 (2013) 
 
G-protein coupled receptor 35
Name:G-protein coupled receptor 35
Type:PROTEIN
Mol. Mass.:34163.11
Organism:Mus musculus
Description:ChEMBL_107606
Residue:307
BDBM50436009
NameBDBM50436009
Synonyms:CHEMBL2392157
TypeSmall organic molecule
Emp. Form.C18H13NO6
Mol. Mass.339.2989
SMILESCOc1ccc(cc1)C(=O)Nc1cccc2c1oc(cc2=O)C(O)=O