Reaction Details
TargetG-protein coupled receptor 35
LigandBDBM50436010
Substrate/Competitorn/a
Meas. Tech.ChEMBL_964310 (CHEMBL2395572)
EC50 17000±n/a nM
Citation Funke, MThimm, DSchiedel, ACMüller, CE 8-Benzamidochromen-4-one-2-carboxylic acids: potent and selective agonists for the orphan G protein-coupled receptor GPR35. J Med Chem56:5182-97 (2013) 
 
G-protein coupled receptor 35
Name:G-protein coupled receptor 35
Type:PROTEIN
Mol. Mass.:34163.11
Organism:Mus musculus
Description:ChEMBL_107606
Residue:307
BDBM50436010
NameBDBM50436010
Synonyms:CHEMBL2392141
TypeSmall organic molecule
Emp. Form.C17H11FN2O3S
Mol. Mass.342.344
SMILESOC(=O)c1ccc(\C=C2/S\C(NC2=O)=N/c2ccccc2F)cc1