Reaction Details
TargetLysine-specific demethylase 2A
LigandBDBM50436039
Substrate/Competitorn/a
Meas. Tech.ChEMBL_964445 (CHEMBL2396334)
IC50 420±n/a nM
Citation Xu, WPodoll, JDDong, XTumber, AOppermann, UWang, X Quantitative analysis of histone demethylase probes using fluorescence polarization. J Med Chem56:5198-202 (2013) 
 
Lysine-specific demethylase 2A
Name:Lysine-specific demethylase 2A
Type:Enzyme Catalytic Domain
Mol. Mass.:132809.04
Organism:Homo sapiens (Human)
Description:n/a
Residue:1162
BDBM50436039
NameBDBM50436039
Synonyms:CHEMBL2392185
TypeSmall organic molecule
Emp. Form.C16H23N3O4
Mol. Mass.321.3715
SMILESNCc1ccc(CNCCCCN(O)C(=O)\C=C\C(O)=O)cc1