Reaction Details
TargetGTPase KRas
LigandBDBM50436053
Substrate/Competitorn/a
Meas. Tech.ChEMBL_968765 (CHEMBL2399318)
IC50 155000±n/a nM
Citation Wang, YKaiser, CEFrett, BLi, HY Targeting mutant KRAS for anticancer therapeutics: a review of novel small molecule modulators. J Med Chem56:5219-30 (2014) 
 
GTPase KRas
Name:GTPase KRas
Type:PROTEIN
Mol. Mass.:21656.10
Organism:Homo sapiens (Human)
Description:ChEMBL_1476955
Residue:189
BDBM50436053
NameBDBM50436053
Synonyms:CHEMBL2396992
TypeSmall organic molecule
Emp. Form.C11H12Cl2N2
Mol. Mass.243.132
SMILESCc1[nH]c2cc(Cl)cc(Cl)c2c1CCN