Reaction Details
TargetCalcitonin gene-related peptide type 1 receptor
LigandBDBM50356282
Substrate/Competitorn/a
Meas. Tech.ChEMBL_969057 (CHEMBL2400791)
Ki 0.021000±n/a nM
Citation Chaturvedula, PVMercer, SEPin, SSThalody, GXu, CConway, CMKeavy, DSignor, LCantor, GHMathias, NMoench, PDenton, RMacci, RSchartman, RWhiterock, VDavis, CMacor, JEDubowchik, GM Discovery of (R)-N-(3-(7-methyl-1H-indazol-5-yl)-1-(4-(1-methylpiperidin-4-yl)-1-oxopropan-2-yl)-4-(2-oxo-1,2-dihydroquinolin-3-yl)piperidine-1-carboxamide (BMS-742413): a potent human CGRP antagonist with superior safety profile for the treatment of migraine through intranasal delivery. Bioorg Med Chem Lett23:3157-61 (2013) 
 
Calcitonin gene-related peptide type 1 receptor
Name:Calcitonin gene-related peptide type 1 receptor
Type:Enzyme Catalytic Domain
Mol. Mass.:52980.45
Organism:Homo sapiens (Human)
Description:Q16602
Residue:461
BDBM50356282
NameBDBM50356282
Synonyms:CHEMBL1910936
TypeSmall organic molecule
Emp. Form.C31H29F2N5O3
Mol. Mass.557.5905
SMILESFc1cc(F)cc(c1)[C@@H]1CNC2(CCCC2)C(=O)N1CC(=O)Nc1ccc2C[C@]3(Cc2c1)C(=O)Nc1ncccc31