Reaction Details
TargetCalcitonin gene-related peptide type 1 receptor
LigandBDBM50184069
Substrate/Competitorn/a
Meas. Tech.ChEMBL_969057 (CHEMBL2400791)
Ki 0.010000±n/a nM
Citation Chaturvedula, PVMercer, SEPin, SSThalody, GXu, CConway, CMKeavy, DSignor, LCantor, GHMathias, NMoench, PDenton, RMacci, RSchartman, RWhiterock, VDavis, CMacor, JEDubowchik, GM Discovery of (R)-N-(3-(7-methyl-1H-indazol-5-yl)-1-(4-(1-methylpiperidin-4-yl)-1-oxopropan-2-yl)-4-(2-oxo-1,2-dihydroquinolin-3-yl)piperidine-1-carboxamide (BMS-742413): a potent human CGRP antagonist with superior safety profile for the treatment of migraine through intranasal delivery. Bioorg Med Chem Lett23:3157-61 (2013) 
 
Calcitonin gene-related peptide type 1 receptor
Name:Calcitonin gene-related peptide type 1 receptor
Type:Enzyme Catalytic Domain
Mol. Mass.:52980.45
Organism:Homo sapiens (Human)
Description:Q16602
Residue:461
BDBM50184069
NameBDBM50184069
Synonyms:CHEMBL207197 N-{(1S)-5-amino-1-[(4-pyridin-4-ylpiperazin-1-yl)carbonyl]pentyl}-3,5-dibromo-Nalpha-{[4-(2-oxo-1,4-dihydroquinazolin-3(2H)-yl)piperidin-1-yl]carbonyl}-D-tyrosinamide | OLCEGEPANT
TypeSmall organic molecule
Emp. Form.C38H47Br2N9O5
Mol. Mass.869.645
SMILESNCCCC[C@H](NC(=O)[C@@H](Cc1cc(Br)c(O)c(Br)c1)NC(=O)N1CCC(CC1)N1Cc2ccccc2NC1=O)C(=O)N1CCN(CC1)c1ccncc1