Reaction Details
TargetTransforming protein RhoA
LigandBDBM50436233
Substrate/Competitorn/a
Meas. Tech.ChEMBL_966397 (CHEMBL2398834)
IC50 26000±n/a nM
Citation Bell, JLHaak, AJWade, SMKirchhoff, PDNeubig, RRLarsen, SD Optimization of novel nipecotic bis(amide) inhibitors of the Rho/MKL1/SRF transcriptional pathway as potential anti-metastasis agents. Bioorg Med Chem Lett23:3826-32 (2013) 
 
Transforming protein RhoA
Name:Transforming protein RhoA
Type:PROTEIN
Mol. Mass.:21766.89
Organism:Homo sapiens (Human)
Description:ChEMBL_966397
Residue:193
BDBM50436233
NameBDBM50436233
Synonyms:CHEMBL2398681
TypeSmall organic molecule
Emp. Form.C25H30ClN3O3
Mol. Mass.455.977
SMILESCC(C)(C)CC(=O)Nc1cccc(c1)C(=O)N1CCCC(C1)C(=O)Nc1ccc(Cl)cc1