Reaction Details
TargetTransforming protein RhoA
LigandBDBM50436250
Substrate/Competitorn/a
Meas. Tech.ChEMBL_966397 (CHEMBL2398834)
IC50 26000±n/a nM
Citation Bell, JLHaak, AJWade, SMKirchhoff, PDNeubig, RRLarsen, SD Optimization of novel nipecotic bis(amide) inhibitors of the Rho/MKL1/SRF transcriptional pathway as potential anti-metastasis agents. Bioorg Med Chem Lett23:3826-32 (2013) 
 
Transforming protein RhoA
Name:Transforming protein RhoA
Type:PROTEIN
Mol. Mass.:21766.89
Organism:Homo sapiens (Human)
Description:ChEMBL_966397
Residue:193
BDBM50436250
NameBDBM50436250
Synonyms:CHEMBL2398706
TypeSmall organic molecule
Emp. Form.C23H20F6N2O4
Mol. Mass.502.4063
SMILESCOC(=O)c1cccc(NC(=O)C2CCCN(C2)C(=O)c2cc(cc(c2)C(F)(F)F)C(F)(F)F)c1