Reaction Details
TargetC-C chemokine receptor type 1
LigandBDBM50436287
Substrate/Competitorn/a
Meas. Tech.ChEMBL_966432 (CHEMBL2398869)
IC50 1.2±n/a nM
Citation Gardner, DSSantella, JBDuncia, JVCarter, PHDhar, TGWu, HGuo, WCavallaro, CVan Kirk, KYarde, MBriceno, SWGrafstrom, RRLiu, RPatel, SRTebben, AJCamac, DKhan, JWatson, AYang, GRose, AFoster, WRCvijic, MEDavies, PHynes, J The discovery of BMS-457, a potent and selective CCR1 antagonist. Bioorg Med Chem Lett23:3833-40 (2013) 
 
C-C chemokine receptor type 1
Name:C-C chemokine receptor type 1
Type:Enzyme
Mol. Mass.:41180.69
Organism:Homo sapiens (Human)
Description:P32246
Residue:355
BDBM50436287
NameBDBM50436287
Synonyms:CHEMBL2398744
TypeSmall organic molecule
Emp. Form.C24H37ClN2O3
Mol. Mass.437.015
SMILESCC(C)CCC(=O)N[C@H](C(C)C)C(=O)N1CC[C@](O)(c2ccc(Cl)cc2)C(C)(C)C1