Reaction Details
TargetC-C chemokine receptor type 1
LigandBDBM50436307
Substrate/Competitorn/a
Meas. Tech.ChEMBL_966433 (CHEMBL2399021)
IC50 1.8±n/a nM
Citation Gardner, DSSantella, JBDuncia, JVCarter, PHDhar, TGWu, HGuo, WCavallaro, CVan Kirk, KYarde, MBriceno, SWGrafstrom, RRLiu, RPatel, SRTebben, AJCamac, DKhan, JWatson, AYang, GRose, AFoster, WRCvijic, MEDavies, PHynes, J The discovery of BMS-457, a potent and selective CCR1 antagonist. Bioorg Med Chem Lett23:3833-40 (2013) 
 
C-C chemokine receptor type 1
Name:C-C chemokine receptor type 1
Type:Enzyme
Mol. Mass.:41180.69
Organism:Homo sapiens (Human)
Description:P32246
Residue:355
BDBM50436307
NameBDBM50436307
Synonyms:CHEMBL2398746
TypeSmall organic molecule
Emp. Form.C23H33ClN2O3
Mol. Mass.420.973
SMILESCC(C)[C@@H](NC(=O)C1CCC1)C(=O)N1CC[C@](O)(c2ccc(Cl)cc2)C(C)(C)C1