Reaction Details
TargetC-C chemokine receptor type 1
LigandBDBM50436282
Substrate/Competitorn/a
Meas. Tech.ChEMBL_966433 (CHEMBL2399021)
IC50 1.2±n/a nM
Citation Gardner, DSSantella, JBDuncia, JVCarter, PHDhar, TGWu, HGuo, WCavallaro, CVan Kirk, KYarde, MBriceno, SWGrafstrom, RRLiu, RPatel, SRTebben, AJCamac, DKhan, JWatson, AYang, GRose, AFoster, WRCvijic, MEDavies, PHynes, J The discovery of BMS-457, a potent and selective CCR1 antagonist. Bioorg Med Chem Lett23:3833-40 (2013) 
 
C-C chemokine receptor type 1
Name:C-C chemokine receptor type 1
Type:Enzyme
Mol. Mass.:41180.69
Organism:Homo sapiens (Human)
Description:P32246
Residue:355
BDBM50436282
NameBDBM50436282
Synonyms:CHEMBL2398769
TypeSmall organic molecule
Emp. Form.C25H32ClN3O3
Mol. Mass.457.993
SMILESCC(C)[C@@H](NC(=O)Cc1ccncc1)C(=O)N1CC[C@](O)(c2ccc(Cl)cc2)C(C)(C)C1